{"text_format":"1","workbook":"xlsx","n_sheets":10,"sheets":["BCEP_Assessment","Privacy_Information","Assessment","GRAFICI","db_GRAFICI","db_Domande","db_Risposte","DATABASE","db_etichette","CONTROLLO"],"not_rendered":{"charts":18,"images":4,"macros":1,"external_links":3,"defined_names":25,"comments":0,"pivot_tables":18},"unopened":[],"bounds":{"document_bytes":16777216,"sheet_cells":100000,"rows_first":2000,"rows_last":500,"rows_between":2000,"halvings":0,"cell_chars":16384,"cell_head_chars":4096},"cells_cut":0,"cells_raw":0,"read":"whole","date_system":"1900"}

{"sheet":"BCEP_Assessment","index":0,"n_rows":9,"n_cols":15,"rows_kept":9,"cut":false,"hidden":false,"merged":[[8,6,8,8],[6,3,6,8],[2,14,2,18],[2,3,2,8],[3,3,3,8],[4,3,4,8],[5,3,5,8]]}
[null,null,"BUSINESS CONTINUITY EMERGENCY PLAN - Assessment "]
[]
[null,"azienda",null,null,null,null,null,null,null,null,null,null,null,null,"istruzioni per compilazione"]
[null,"nome"]
[null,"cognome"]
[null,"ruolo"]
[null,"e-mail"]
[]
[null,"Accettazione informativa Privacy"]

{"sheet":"Privacy_Information","index":1,"n_rows":2,"n_cols":2,"rows_kept":2,"cut":false,"hidden":false,"merged":[]}
[]
["Informativa ai ​sensi dell’articolo 13 del GDPR 2016/679​ ​(General Data Protection Regulation)",{"$f":"IF(BCEP_Assessment!$G$9=\"\",\"\",BCEP_Assessment!$G$9)","v":""}]

{"sheet":"Assessment","index":2,"n_rows":1001,"n_cols":7,"rows_kept":1001,"cut":false,"hidden":true,"merged":[]}
[null,"BUSINESS CONTINUITY EMERGENCY PLAN - Assessment ",null,null,null,null,{"$f":"IF(COUNTA($C$3:$C$200)-COUNTA($F$3:$F$200)=0,CONCATENATE(\"Complimenti:\",CHAR(10),\"hai risposto a tutte le domande\"),CONCATENATE(\"Le domande senza risposta sono:\",CHAR(10),COUNTA($C$3:$C$200)-COUNTA($F$3:$F$200)))","v":"Le domande senza risposta sono:\n100"}]
["SEZIONE\nnr","PILLAR","DOMANDA\nriferimento","DOMANDA","RISPOSTA\npossibile","RISPOSTA","NOTE"]
[1,"Market","D1_01","L'azienda ha attivato misure di monitoring sullo stato di salute dei suoi clienti?",{"$f":"IF($A3=\"\",\"\",IF(INDEX(db_Risposte!$H:$H,MATCH($C3,db_Risposte!$D:$D,0),1)=0,\"\",INDEX(db_Risposte!$H:$H,MATCH($C3,db_Risposte!$D:$D,0),1)))","v":"SI  ;  NO  ;  NON_APPLICABILE"}]
[1,"Market","D1_02","L'azienda ha valutato l'impatto nel tempo causato dagli effetti di una significativa diminuzione del proprio fatturato e/o dal fallimento di un suo cliente strategico ?",{"$f":"IF($A4=\"\",\"\",IF(INDEX(db_Risposte!$H:$H,MATCH($C4,db_Risposte!$D:$D,0),1)=0,\"\",INDEX(db_Risposte!$H:$H,MATCH($C4,db_Risposte!$D:$D,0),1)))","v":"SI  ;  NO  ;  NON_APPLICABILE"}]
[1,"Market","D1_03","L'azienda ha identificato piani strutturati di continuità operativa per rispondere all'emergenza in corso? ",{"$f":"IF($A5=\"\",\"\",IF(INDEX(db_Risposte!$H:$H,MATCH($C5,db_Risposte!$D:$D,0),1)=0,\"\",INDEX(db_Risposte!$H:$H,MATCH($C5,db_Risposte!$D:$D,0),1)))","v":"SI  ;  NO  ;  NON_APPLICABILE"}]
[1,"Market","D1_04","I piani includono la scelta dei business e delle attività fondamentali, incluse le attività di individuazione di clienti e partner strategici, nonché delle regole di comunicazione?  ",{"$f":"IF($A6=\"\",\"\",IF(INDEX(db_Risposte!$H:$H,MATCH($C6,db_Risposte!$D:$D,0),1)=0,\"\",INDEX(db_Risposte!$H:$H,MATCH($C6,db_Risposte!$D:$D,0),1)))","v":"SI  ;  NO  ;  NON_APPLICABILE"}]
[1,"Market","D1_05","L'azienda ha pianificato un programma di verifica periodica dei piani di continuità operativa ed una successiva attività di riesame dei risultati ? ",{"$f":"IF($A7=\"\",\"\",IF(INDEX(db_Risposte!$H:$H,MATCH($C7,db_Risposte!$D:$D,0),1)=0,\"\",INDEX(db_Risposte!$H:$H,MATCH($C7,db_Risposte!$D:$D,0),1)))","v":"SI  ;  NO  ;  NON_APPLICABILE"}]
[1,"Market","D1_06","Avete revisionato i contratti con i clienti alla luce dell’attuale situazione di crisi, introducendo o verificando la presenza di eventuali clausole a vostra tutela?",{"$f":"IF($A8=\"\",\"\",IF(INDEX(db_Risposte!$H:$H,MATCH($C8,db_Risposte!$D:$D,0),1)=0,\"\",INDEX(db_Risposte!$H:$H,MATCH($C8,db_Risposte!$D:$D,0),1)))","v":"SI  ;  NO  ;  NON_APPLICABILE"}]
[1,"Market","D1_07","Avete implementato un sistema per l’analisi, la gestione e la valutazione di eventuali reclami da parte della clientela? ",{"$f":"IF($A9=\"\",\"\",IF(INDEX(db_Risposte!$H:$H,MATCH($C9,db_Risposte!$D:$D,0),1)=0,\"\",INDEX(db_Risposte!$H:$H,MATCH($C9,db_Risposte!$D:$D,0),1)))","v":"SI  ;  NO  ;  NON_APPLICABILE"}]
[1,"Market","D1_08","L’azienda tiene in considerazione i rischi ambientali e sociali nella gestione del proprio business e monitora le prorie performance sulle tematiche ambeintali e sociali ?",{"$f":"IF($A10=\"\",\"\",IF(INDEX(db_Risposte!$H:$H,MATCH($C10,db_Risposte!$D:$D,0),1)=0,\"\",INDEX(db_Risposte!$H:$H,MATCH($C10,db_Risposte!$D:$D,0),1)))","v":"SI  ;  NO  ;  NON_APPLICABILE"}]
[1,"Market","D1_09","L’azienda ha identificato le aree ad alto potenziale di business e ha identificato un posizionamento di sostenibilità?",{"$f":"IF($A11=\"\",\"\",IF(INDEX(db_Risposte!$H:$H,MATCH($C11,db_Risposte!$D:$D,0),1)=0,\"\",INDEX(db_Risposte!$H:$H,MATCH($C11,db_Risposte!$D:$D,0),1)))","v":"SI  ;  NO  ;  NON_APPLICABILE"}]
[1,"Market","D1_10","L’azienda ha identificato le variabili chiave per guidare l’innovazione e ne ha valutato gli impatti economici, sociali e ambientali?",{"$f":"IF($A12=\"\",\"\",IF(INDEX(db_Risposte!$H:$H,MATCH($C12,db_Risposte!$D:$D,0),1)=0,\"\",INDEX(db_Risposte!$H:$H,MATCH($C12,db_Risposte!$D:$D,0),1)))","v":"SI  ;  NO  ;  NON_APPLICABILE"}]
[1,"Market","D1_11","L’azienda rendiconta e comunica le proprie performance e i propri impatti agli stakeholder chiave?",{"$f":"IF($A13=\"\",\"\",IF(INDEX(db_Risposte!$H:$H,MATCH($C13,db_Risposte!$D:$D,0),1)=0,\"\",INDEX(db_Risposte!$H:$H,MATCH($C13,db_Risposte!$D:$D,0),1)))","v":"SI  ;  NO  ;  NON_APPLICABILE"}]
[null,null,null,null,{"$f":"IF($A14=\"\",\"\",IF(INDEX(db_Risposte!$H:$H,MATCH($C14,db_Risposte!$D:$D,0),1)=0,\"\",INDEX(db_Risposte!$H:$H,MATCH($C14,db_Risposte!$D:$D,0),1)))","v":""}]
[2,"Supply Chain","D2_01","L'azienda ha attivato misure di monitoring constante sullo stato di salute dei suoi fornitori?",{"$f":"IF($A15=\"\",\"\",IF(INDEX(db_Risposte!$H:$H,MATCH($C15,db_Risposte!$D:$D,0),1)=0,\"\",INDEX(db_Risposte!$H:$H,MATCH($C15,db_Risposte!$D:$D,0),1)))","v":"SI  ;  NO  ;  NON_APPLICABILE"}]
{"$rows_left_out":987}
{"sheet":"GRAFICI","index":3,"n_rows":93,"n_cols":22,"rows_kept":93,"cut":false,"hidden":true,"merged":[[6,1,6,7],[6,10,6,16],[29,1,29,16],[2,1,2,16],[93,1,105,16],[31,14,36,16],[45,14,50,16],[59,14,64,16],[66,14,71,16],[38,14,43,16],[52,14,57,16],[80,14,85,16],[73,14,78,16],[92,1,92,16]]}
[null,"BUSINESS CONTINUITY EMERGENCY PLAN - Assessment ",null,null,null,null,null,null,null,null,null,null,null,null,null,null,null,null,null,null,"check",{"$f":"db_GRAFICI!N4","v":"Ok"}]
[]
[null,{"$f":"IF(BCEP_Assessment!$D$3=\"\",\"\",BCEP_Assessment!$D$3)","v":""}]
[]
[]
[]
[null,"risultato GENERALE",null,null,null,null,null,null,null,null,"risultato PILLAR"]
[]
[]
[]
[]
[]
[]
[]
[]
{"$rows_left_out":79}
{"sheet":"db_GRAFICI","index":4,"n_rows":184,"n_cols":15,"rows_kept":184,"cut":false,"hidden":true,"merged":[]}
["risultato GENERALE"]
[null,null,null,null,null,null,null,null,null,null,null,null,null,"check"]
[null,"Valori",null,null,null,null,null,null,null,null,null,null,null,"finale","riga con errore"]
[null,"Somma di RISPOSTA_punteggio","Somma di RISPOSTA_punteggio_max",null,null,"area presidiata","area di miglioramento",null,null,"check",null,null,null,{"$f":"IF(ISERROR(MATCH(\"Err\",$J:$J,0)),\"Ok\",\"Err\")","v":"Ok"},{"$f":"IF($N$4=\"Err\",MATCH(\"Err\",$J:$J,0),\"\")","v":""}]
["Totale",92,103,null,null,{"$f":"IFERROR(B5/C5,0)","v":0.89320388349514568},{"$f":"1-F5","v":0.10679611650485432},null,null,{"$f":"IF(AND($B5=0,$C5=0),\"Ok\",IF(ISERROR(B5/C5),\"Err\",\"Ok\"))","v":"Ok"}]
[]
[]
[]
[]
[]
["risultato PILLAR"]
[]
[null,"Valori"]
["PILLAR_desc","Somma di RISPOSTA_punteggio","Somma di RISPOSTA_punteggio_max",null,"pillar","area presidiata","area di miglioramento",null,null,"check"]
["Market",11,11,null,{"$f":"A15","v":"Market"},{"$f":"IFERROR(INDEX($B$13:$B$23,MATCH(E15,$A$13:$A$23,0),1)/INDEX($C$13:$C$23,MATCH(E15,$A$13:$A$23,0),1),0)","v":1},{"$f":"1-F15","v":0},null,null,{"$f":"IF(AND($B15=0,$C15=0),\"Ok\",IF(ISERROR(INDEX($B$13:$B$23,MATCH(E15,$A$13:$A$23,0),1)/INDEX($C$13:$C$23,MATCH(E15,$A$13:$A$23,0),1)),\"Err\",\"Ok\"))","v":"Ok"}]
{"$rows_left_out":170}
{"sheet":"db_Domande","index":5,"n_rows":111,"n_cols":6,"rows_kept":111,"cut":false,"hidden":true,"merged":[]}
[]
[]
[]
["SEZIONE_cod","SEZIONE_desc","DOMANDA_cod","DOMANDA_desc","DOMANDA_L01","DOMANDA_L02"]
[1,"Market","D1_01","L'azienda ha attivato misure di monitoring sullo stato di salute dei suoi clienti?","Emergency"]
[1,"Market","D1_02","L'azienda ha valutato l'impatto nel tempo causato dagli effetti di una significativa diminuzione del proprio fatturato e/o dal fallimento di un suo cliente strategico ?","Continuity"]
[1,"Market","D1_03","L'azienda ha identificato piani strutturati di continuità operativa per rispondere all'emergenza in corso? ","Emergency"]
[1,"Market","D1_04","I piani includono la scelta dei business e delle attività fondamentali, incluse le attività di individuazione di clienti e partner strategici, nonché delle regole di comunicazione?  ","Continuity"]
[1,"Market","D1_05","L'azienda ha pianificato un programma di verifica periodica dei piani di continuità operativa ed una successiva attività di riesame dei risultati ? ","Planning"]
[1,"Market","D1_06","Avete revisionato i contratti con i clienti alla luce dell’attuale situazione di crisi, introducendo o verificando la presenza di eventuali clausole a vostra tutela?","Monitoring"]
[1,"Market","D1_07","Avete implementato un sistema per l’analisi, la gestione e la valutazione di eventuali reclami da parte della clientela? ","Monitoring"]
[1,"Market","D1_08","L’azienda tiene in considerazione i rischi ambientali e sociali nella gestione del proprio business e monitora le prorie performance sulle tematiche ambeintali e sociali ?","Continuity"]
[1,"Market","D1_09","L’azienda ha identificato le aree ad alto potenziale di business e ha identificato un posizionamento di sostenibilità?","Continuity"]
[1,"Market","D1_10","L’azienda ha identificato le variabili chiave per guidare l’innovazione e ne ha valutato gli impatti economici, sociali e ambientali?","Planning"]
[1,"Market","D1_11","L’azienda rendiconta e comunica le proprie performance e i propri impatti agli stakeholder chiave?","Monitoring"]
{"$rows_left_out":97}
{"sheet":"db_Risposte","index":6,"n_rows":808,"n_cols":10,"rows_kept":808,"cut":false,"hidden":true,"merged":[]}
["PK","SEZIONE_cod","SEZIONE_desc","DOMANDA_cod","DOMANDA_desc","RISPOSTA_cod","RISPOSTA_desc","RISPOSTA_possibile_rif","RISPOSTA_possibile_nr","RISPOSTA_punteggio"]
[{"$f":"IF($B2=\"\",\"\",$D2&\"_\"&$G2)","v":"D1_01_SI"},1,"Market","D1_01",{"$f":"IF($B2=\"\",\"\",IFERROR(INDEX(db_Domande!$D:$D,MATCH($D2,db_Domande!$C:$C,0),1),\"\"))","v":"L'azienda ha attivato misure di monitoring sullo stato di salute dei suoi clienti?"},{"$f":"IF($B2=\"\",\"\",\"R\"&RIGHT($D2,4)&\"_\"&TEXT(ROW()-MATCH($D2,$D:$D,0)+1,\"00\"))","v":"R1_01_01"},"SI","SI  ;  NO  ;  NON_APPLICABILE",3,1]
[{"$f":"IF($B3=\"\",\"\",$D3&\"_\"&$G3)","v":"D1_01_NO"},1,"Market","D1_01",{"$f":"IF($B3=\"\",\"\",IFERROR(INDEX(db_Domande!$D:$D,MATCH($D3,db_Domande!$C:$C,0),1),\"\"))","v":"L'azienda ha attivato misure di monitoring sullo stato di salute dei suoi clienti?"},"R1_01_02","NO",null,null,0]
["D1_01_NON_APPLICABILE",1,"Market","D1_01",{"$f":"IF($B4=\"\",\"\",IFERROR(INDEX(db_Domande!$D:$D,MATCH($D4,db_Domande!$C:$C,0),1),\"\"))","v":"L'azienda ha attivato misure di monitoring sullo stato di salute dei suoi clienti?"},"R1_01_03","NON_APPLICABILE",null,null,0]
["D1_01_",1,"Market","D1_01",{"$f":"IF($B5=\"\",\"\",IFERROR(INDEX(db_Domande!$D:$D,MATCH($D5,db_Domande!$C:$C,0),1),\"\"))","v":"L'azienda ha attivato misure di monitoring sullo stato di salute dei suoi clienti?"},"R1_01_04"]
["D1_01_",1,"Market","D1_01",{"$f":"IF($B6=\"\",\"\",IFERROR(INDEX(db_Domande!$D:$D,MATCH($D6,db_Domande!$C:$C,0),1),\"\"))","v":"L'azienda ha attivato misure di monitoring sullo stato di salute dei suoi clienti?"},"R1_01_05"]
["D1_02_SI",1,"Market","D1_02",{"$f":"IF($B7=\"\",\"\",IFERROR(INDEX(db_Domande!$D:$D,MATCH($D7,db_Domande!$C:$C,0),1),\"\"))","v":"L'azienda ha valutato l'impatto nel tempo causato dagli effetti di una significativa diminuzione del proprio fatturato e/o dal fallimento di un suo cliente strategico ?"},"R1_02_01","SI","SI  ;  NO  ;  NON_APPLICABILE",3,1]
["D1_02_NO",1,"Market","D1_02",{"$f":"IF($B8=\"\",\"\",IFERROR(INDEX(db_Domande!$D:$D,MATCH($D8,db_Domande!$C:$C,0),1),\"\"))","v":"L'azienda ha valutato l'impatto nel tempo causato dagli effetti di una significativa diminuzione del proprio fatturato e/o dal fallimento di un suo cliente strategico ?"},"R1_02_02","NO",null,null,0]
["D1_02_NON_APPLICABILE",1,"Market","D1_02",{"$f":"IF($B9=\"\",\"\",IFERROR(INDEX(db_Domande!$D:$D,MATCH($D9,db_Domande!$C:$C,0),1),\"\"))","v":"L'azienda ha valutato l'impatto nel tempo causato dagli effetti di una significativa diminuzione del proprio fatturato e/o dal fallimento di un suo cliente strategico ?"},"R1_02_03","NON_APPLICABILE",null,null,0]
["D1_02_",1,"Market","D1_02",{"$f":"IF($B10=\"\",\"\",IFERROR(INDEX(db_Domande!$D:$D,MATCH($D10,db_Domande!$C:$C,0),1),\"\"))","v":"L'azienda ha valutato l'impatto nel tempo causato dagli effetti di una significativa diminuzione del proprio fatturato e/o dal fallimento di un suo cliente strategico ?"},"R1_02_04"]
["D1_02_",1,"Market","D1_02",{"$f":"IF($B11=\"\",\"\",IFERROR(INDEX(db_Domande!$D:$D,MATCH($D11,db_Domande!$C:$C,0),1),\"\"))","v":"L'azienda ha valutato l'impatto nel tempo causato dagli effetti di una significativa diminuzione del proprio fatturato e/o dal fallimento di un suo cliente strategico ?"},"R1_02_05"]
["D1_03_SI",1,"Market","D1_03",{"$f":"IF($B12=\"\",\"\",IFERROR(INDEX(db_Domande!$D:$D,MATCH($D12,db_Domande!$C:$C,0),1),\"\"))","v":"L'azienda ha identificato piani strutturati di continuità operativa per rispondere all'emergenza in corso? "},"R1_03_01","SI","SI  ;  NO  ;  NON_APPLICABILE",3,1]
["D1_03_NO",1,"Market","D1_03",{"$f":"IF($B13=\"\",\"\",IFERROR(INDEX(db_Domande!$D:$D,MATCH($D13,db_Domande!$C:$C,0),1),\"\"))","v":"L'azienda ha identificato piani strutturati di continuità operativa per rispondere all'emergenza in corso? "},"R1_03_02","NO",null,null,0]
["D1_03_NON_APPLICABILE",1,"Market","D1_03",{"$f":"IF($B14=\"\",\"\",IFERROR(INDEX(db_Domande!$D:$D,MATCH($D14,db_Domande!$C:$C,0),1),\"\"))","v":"L'azienda ha identificato piani strutturati di continuità operativa per rispondere all'emergenza in corso? "},"R1_03_03","NON_APPLICABILE",null,null,0]
["D1_03_",1,"Market","D1_03",{"$f":"IF($B15=\"\",\"\",IFERROR(INDEX(db_Domande!$D:$D,MATCH($D15,db_Domande!$C:$C,0),1),\"\"))","v":"L'azienda ha identificato piani strutturati di continuità operativa per rispondere all'emergenza in corso? "},"R1_03_04"]
{"$rows_left_out":794}
{"sheet":"DATABASE","index":7,"n_rows":300,"n_cols":14,"rows_kept":300,"cut":false,"hidden":true,"merged":[]}
[null,null,"formule >>",{"$f":"IF($C1=\"\",\"\",IFERROR(INDEX(db_Domande!$D:$D,MATCH($C1,db_Domande!$C:$C,0),1),\"\"))","v":""},{"$f":"IF($F1=\"\",\"\",IF(F1=\"Risposta_Mancante\",\"RM\",INDEX(db_Risposte!$F:$F,MATCH($C1&\"_\"&$F1,db_Risposte!$A:$A,0),1)))","v":""},{"$f":"IF(OR($A1=\"\",$D1=\"\"),\"\",IF(INDEX(Assessment!$F:$F,MATCH($C1,Assessment!$C:$C,0),1)=0,\"Risposta_Mancante\",INDEX(Assessment!$F:$F,MATCH($C1,Assessment!$C:$C,0),1)))","v":""},{"$f":"IF(OR($A1=\"\",$D1=\"\"),\"\",IF(F1=\"Risposta_Mancante\",\"\",INDEX(db_Risposte!$J:$J,MATCH($E1,db_Risposte!$F:$F,0),1)))","v":""},{"$f":"IF($D1=\"\",\"\",IF($F1=\"NON_APPLICABILE\",0,MAX(OFFSET(db_Risposte!$J:$J,MATCH($C1,db_Risposte!$D:$D,0)-1,0,COUNTIF(db_Risposte!$D:$D,$C1),1))))","v":""},{"$f":"IF($D1=\"\",\"\",IF(INDEX(db_Domande!$E:$E,MATCH($C1,db_Domande!$C:$C,0),1)=0,\"\",INDEX(db_Domande!$E:$E,MATCH($C1,db_Domande!$C:$C,0),1)))","v":""},{"$f":"IF($D1=\"\",\"\",IF(INDEX(db_Domande!$F:$F,MATCH($C1,db_Domande!$C:$C,0),1)=0,\"\",INDEX(db_Domande!$F:$F,MATCH($C1,db_Domande!$C:$C,0),1)))","v":""},{"$f":"IF($C1=\"\",\"\",IF(BCEP_Assessment!$D$3=\"\",\"\",BCEP_Assessment!$D$3))","v":""},{"$f":"IF($C1=\"\",\"\",IF(BCEP_Assessment!$D$5=\"\",\"\",BCEP_Assessment!$D$5)&\"_\"&IF(BCEP_Assessment!$D$4=\"\",\"\",BCEP_Assessment!$D$4))","v":"_"},{"$f":"IF($C1=\"\",\"\",IF(BCEP_Assessment!$D$6=\"\",\"\",BCEP_Assessment!$D$6))","v":""},{"$f":"IF($C1=\"\",\"\",IF(BCEP_Assessment!$D$7=\"\",\"\",BCEP_Assessment!$D$7))","v":""}]
[]
[]
["PILLAR_cod","PILLAR_desc","DOMANDA_cod","DOMANDA_desc","RISPOSTA_cod","RISPOSTA_desc","RISPOSTA_punteggio","RISPOSTA_punteggio_max","DOMANDA_L01","DOMANDA_L02","AZIENDA","COGNOME_NOME","RUOLO","E-mail"]
[1,"Market","D1_01","L'azienda ha attivato misure di monitoring sullo stato di salute dei suoi clienti?","R1_01_01","SI",1,1,"Emergency","","s","s_s","s","s"]
[1,"Market","D1_02","L'azienda ha valutato l'impatto nel tempo causato dagli effetti di una significativa diminuzione del proprio fatturato?","R1_02_01","SI",1,1,"Continuity","","s","s_s","s","s"]
[1,"Market","D1_03","L'azienda ha definito processi e responsabili incaricati di comunicare con i clienti, al fine di garantire lo scambio delle corrette informazioni anche nell’attuale situazione di emergenza? ","R1_03_01","SI",1,1,"Emergency","","s","s_s","s","s"]
[1,"Market","D1_04","L'azienda ha identificato piani strutturati di continuità operativa per rispondere all'emergenza in corso? ","R1_04_01","SI",1,1,"Continuity","","s","s_s","s","s"]
[1,"Market","D1_05","I piani includono la scelta dei business e delle attività fondamentali, incluse le attività di individuazione di clienti e partner strategici, nonché delle regole di comunicazione?  ","R1_05_01","SI",1,1,"Planning","","s","s_s","s","s"]
[1,"Market","D1_06","L'azienda ha pianificato un programma di verifica periodica dei piani di continuità operativa? ","R1_06_01","SI",1,1,"Monitoring","","s","s_s","s","s"]
[1,"Market","D1_07","Al termine delle verifiche sui piani di continuità, l'azienda effettua un riesame dei risultati al fine di valutare eventuali modifiche ai propri processi, anche in termini di necessità di formazione delle risorse coinvolte od aumento della consapevolezza di tutta la catena di continuità? ","R1_07_01","SI",1,1,"Monitoring","","s","s_s","s","s"]
[1,"Market","D1_08","L'azienda ha integrato i concetti di continuità operativa anche nella quotidiana gestione aziendale, in modo che tali aspetti siano sempre presi in considerazione dal management?","R1_08_01","SI",1,1,"Continuity","","s","s_s","s","s"]
[1,"Market","D1_09","L'azienda subirebbe in maniera significativa gli effetti derivanti da un eventuale fallimento di un suo cliente strategico?","R1_09_01","SI",1,1,"Continuity","","s","s_s","s","s"]
[1,"Market","D1_10","Avete revisionato i contratti con i clienti alla luce dell’attuale situazione di crisi, introducendo o verificando la presenza di eventuali clausole a vostra tutela?","R1_10_01","SI",1,1,"Planning","","s","s_s","s","s"]
[1,"Market","D1_11","Avete implementato un sistema per l’analisi, la gestione e la valutazione di eventuali reclami da parte della clientela? ","R1_11_01","SI",1,1,"Emergency","","s","s_s","s","s"]
{"$rows_left_out":286}
{"sheet":"db_etichette","index":8,"n_rows":20,"n_cols":6,"rows_kept":20,"cut":false,"hidden":true,"merged":[]}
["DOMANDA_L01",null,null,null,null,"DOMANDA_L02"]
["Continuity"]
["Emergency"]
["Monitoring"]
["Planning"]
[]
[]
[]
[]
[]
[]
[]
[]
[]
[]
{"$rows_left_out":6}
{"sheet":"CONTROLLO","index":9,"n_rows":15,"n_cols":16,"rows_kept":15,"cut":false,"hidden":true,"merged":[]}
[null,"BCEP - Controllo"]
["01","definisco DOMANDE:","identificare l'elenco delle DOMANDE",null,null,null,null,null,null,null,null,null,null,null,"foglio rif:","db_Domande"]
[null,"popolare i cluster per raggruppare le domande in \"db_Etichette\""]
["02","definire RISPOSTE:","inserire le RISPOSTE desiderate, il PUNTEGGIO",null,null,null,null,null,null,null,null,null,null,null,"foglio rif:","db_Risposte"]
[null,"le risposte generano i MENU a TENDINA del foglio Audit e l'etichetta delle POSSIBILI RISPOSTE"]
["03","generare ASSESSMENT:","generare il foglio ASSESSMENT ovvero quello che sarà compilato dall'utente",null,null,null,null,null,null,null,null,null,null,null,"foglio rif:","Assessment"]
[]
[]
[]
[]
[]
["04","popolamento DATABASE:","popolamento del DATABASE in base alle risposta dell'ASSESSMENT",null,null,null,null,null,null,null,null,null,null,null,"foglio rif:","DATABASE"]
[null,"copia/incolla le formule e poi copia/incolla i valori"]
["04","aggiornamento GRAFICI:","generazione foglio finale dei GRAFICI",null,null,null,null,null,null,null,null,null,null,null,"foglio rif:","db_GRAFICI | GRAFICI"]
[null,"aggiorna le pivot presenti nel foglio db_GRAFICI in cui sono riportati i valori necessari per generare i grafici"]